Reaction Details
TargetSodium channel protein type 5 subunit alpha
LigandBDBM50077471
Substrate/Competitorn/a
Meas. Tech.ChEMBL_1573822 (CHEMBL3803507)
IC50>5000±n/a nM
Citation Murray, JKLong, JZou, ALigutti, JAndrews, KLPoppe, LBiswas, KMoyer, BDMcDonough, SIMiranda, LP Single Residue Substitutions That Confer Voltage-Gated Sodium Ion Channel Subtype Selectivity in the NaV1.7 Inhibitory Peptide GpTx-1. J Med Chem59:2704-17 (2016) 
 
Sodium channel protein type 5 subunit alpha
Name:Sodium channel protein type 5 subunit alpha
Type:Enzyme
Mol. Mass.:226908.60
Organism:Homo sapiens (Human)
Description:Q14524
Residue:2016
BDBM50077471
NameBDBM50077471
Synonyms:CHEMBL3416886
TypeSmall organic molecule
Emp. Form.C176H271N53O45S7
Mol. Mass.4073.818
SMILES[H][C@@]12CCCN1C(=O)[C@H](CCCNC(N)=N)NC(=O)[C@]1([H])CSSC[C@H](NC(=O)[C@@H](N)CC(O)=O)C(=O)N[C@@H](CC(C)C)C(=O)NCC(=O)N[C@@H](Cc3ccccc3)C(=O)N[C@@H](CCSC)C(=O)N[C@@H](CCCNC(N)=N)C(=O)N[C@@H](CCCCN)C(=O)N[C@@]3([H])CSSC[C@]([H])(NC(=O)[C@@H](NC(=O)[C@H](CC(C)C)NC(=O)[C@H](CC(N)=O)NC2=O)C(C)C)C(=O)N[C@@H](CO)C(=O)N[C@@H](CCCNC(N)=N)C(=O)N[C@@]([H])([C@@H](C)O)C(=O)N[C@@H](Cc2cnc[nH]2)C(=O)N[C@@H](CCCCN)C(=O)N[C@@H](Cc2c[nH]c4ccccc24)C(=O)N[C@@H](CSSC[C@]([H])(NC(=O)[C@H](CCCCN)NC(=O)[C@H](CC(O)=O)NC(=O)[C@H](CC(N)=O)NC(=O)[C@H](CC(O)=O)NC(=O)[C@]2([H])CCCN2C(=O)[C@@]([H])(NC3=O)[C@@H](C)CC)C(=O)N1)C(=O)N[C@@H](CCCCN)C(=O)N[C@@H](Cc1ccc(O)cc1)C(=O)N[C@@H](C(C)C)C(=O)N[C@@H](Cc1ccccc1)C(N)=O