Reaction Details
TargetAlpha-1D adrenergic receptor
LigandBDBM50164732
Substrate/Competitorn/a
Meas. Tech.ChEMBL_1575788 (CHEMBL3801620)
Ki 10±n/a nM
Citation Sakauchi, NKohara, YSato, ASuzaki, TImai, YOkabe, YImai, SSaikawa, RNagabukuro, HKuno, HFujita, HKamo, IYoshida, M Discovery of 5-Chloro-1-(5-chloro-2-(methylsulfonyl)benzyl)-2-imino-1,2-dihydropyridine-3-carboxamide (TAK-259) as a Novel, Selective, and Orally Activea1D Adrenoceptor Antagonist with Antiurinary Frequency Effects: Reducing Human Ether-a-go-go-Related Gene (hERG) Liabilities. J Med Chem59:2989-3002 (2016) 
 
Alpha-1D adrenergic receptor
Name:Alpha-1D adrenergic receptor
Type:Enzyme Catalytic Domain
Mol. Mass.:60485.82
Organism:Homo sapiens (Human)
Description:adrenergic Alpha1D ADRA1D HUMAN::P25100
Residue:572
BDBM50164732
NameBDBM50164732
Synonyms:CHEMBL3798655
TypeSmall organic molecule
Emp. Form.C14H11ClN4O
Mol. Mass.286.716
SMILESNC(=O)c1cc(Cl)cn(Cc2cccc(c2)C#N)c1=N