Reaction Details
TargetCalmodulin
LigandBDBM50165124
Substrate/Competitorn/a
Meas. Tech.ChEMBL_1576535 (CHEMBL3803975)
Kd 470±n/a nM
Citation Bruno, CCavalluzzi, MMRusciano, MRLovece, ACarrieri, APracella, RGiannuzzi, GPolimeno, LViale, MIllario, MFranchini, CLentini, G The chemosensitizing agent lubeluzole binds calmodulin and inhibits Ca(2+)/calmodulin-dependent kinase II. Eur J Med Chem116:36-45 (2016) 
 
Calmodulin
Name:Calmodulin
Type:PROTEIN
Mol. Mass.:16813.73
Organism:Bos taurus
Description:ChEMBL_1458985
Residue:149
BDBM50165124
NameBDBM50165124
Synonyms:CHEMBL3798296
TypeSmall organic molecule
Emp. Form.C28H37N3O
Mol. Mass.431.6129
SMILESCOc1cccc(CN(CCN(CCN(C)C)Cc2ccccc2)Cc2ccccc2)c1