Reaction Details
TargetCalmodulin
LigandBDBM50111446
Substrate/Competitorn/a
Meas. Tech.ChEMBL_1576536 (CHEMBL3803976)
Kd 7200±n/a nM
Citation Bruno, CCavalluzzi, MMRusciano, MRLovece, ACarrieri, APracella, RGiannuzzi, GPolimeno, LViale, MIllario, MFranchini, CLentini, G The chemosensitizing agent lubeluzole binds calmodulin and inhibits Ca(2+)/calmodulin-dependent kinase II. Eur J Med Chem116:36-45 (2016) 
 
Calmodulin
Name:Calmodulin
Type:PROTEIN
Mol. Mass.:16813.73
Organism:Bos taurus
Description:ChEMBL_1458985
Residue:149
BDBM50111446
NameBDBM50111446
Synonyms:5-Chloro-naphthalene-1-sulfonic acid (6-amino-hexyl)-amide N-(6-AMINOHEXYL)-5-CHLORO-1-NAPHTHALENESULFONAMIDE | N-(6-aminohexyl)-5-chloronaphthalene-1-sulfonamide
TypeSmall organic molecule
Emp. Form.C16H21ClN2O2S
Mol. Mass.340.868
SMILESNCCCCCCNS(=O)(=O)c1cccc2c(Cl)cccc12