Reaction Details
TargetCalmodulin
LigandBDBM50001884
Substrate/Competitorn/a
Meas. Tech.ChEMBL_1572743 (CHEMBL3804252)
IC50 140000±n/a nM
Citation Bruno, CCavalluzzi, MMRusciano, MRLovece, ACarrieri, APracella, RGiannuzzi, GPolimeno, LViale, MIllario, MFranchini, CLentini, G The chemosensitizing agent lubeluzole binds calmodulin and inhibits Ca(2+)/calmodulin-dependent kinase II. Eur J Med Chem116:36-45 (2016) 
 
Calmodulin
Name:Calmodulin
Type:PROTEIN
Mol. Mass.:16813.73
Organism:Bos taurus
Description:ChEMBL_1458985
Residue:149
BDBM50001884
NameBDBM50001884
Synonyms:2-[4-(4-Methyl-benzyl)-piperazin-1-yl]-1-(2-methyl-2,3-dihydro-indol-1-yl)-ethanone 3-chloro-6-(4-methyl-piperazin-1-yl)-5H-dibenzo[b,e][1,4]diazepine 8-Chloro-11-(4-methyl-piperazin-1-yl)-5H-dibenzo[b,e][1,4]diazepine( Clozepine ) 8-Chloro-11-(4-methyl-piperazin-1-yl)-5H-dibenzo[b,e][1,4]diazepine(Clopazine) 8-chloro-11-(4-methylpiperazin-1-yl)-5H-dibenzo[b,e][1,4]diazepine CHEMBL538973 CLOZAPINE, 8-CHLORO-11-(4-METHYL-PIPERAZIN-1-YL)-5H-DIBENZO[B,E][1,4]DIAZEPINE HF 1854 US10752588, Compound Clozapine | US11498896, Compound Clozapine
TypeSmall organic molecule
Emp. Form.C18H19ClN4
Mol. Mass.326.823
SMILESCN1CCN(CC1)C1=Nc2cc(Cl)ccc2Nc2ccccc12