Reaction Details
TargetGlutamate receptor ionotropic, NMDA 2B
LigandBDBM50204884
Substrate/Competitorn/a
Meas. Tech.ChEMBL_1572787 (CHEMBL3804511)
Ki 30±n/a nM
Citation Lütnant, ISchepmann, DWünsch, B Benzimidazolone bioisosteres of potent GluN2B selective NMDA receptor antagonists. Eur J Med Chem116:136-146 (2016) 
 
Glutamate receptor ionotropic, NMDA 2B
Name:Glutamate receptor ionotropic, NMDA 2B
Type:PROTEIN
Mol. Mass.:166375.46
Organism:Homo sapiens (Human)
Description:ChEMBL_1438829
Residue:1484
BDBM50204884
NameBDBM50204884
Synonyms:6-(2-(4-(4-fluorobenzyl)piperidin-1-yl)ethylsulfinyl)benzo[d]oxazol-2(3H)-one CHEMBL219631 besonprodil
TypeSmall organic molecule
Emp. Form.C21H23FN2O3S
Mol. Mass.402.482
SMILESFc1ccc(CC2CCN(CCS(=O)c3ccc4[nH]c(=O)oc4c3)CC2)cc1