Reaction Details
TargetGrowth hormone secretagogue receptor type 1
LigandBDBM102979
Substrate/Competitorn/a
Meas. Tech.ChEMBL_1574205 (CHEMBL3802020)
Ki 2.0±n/a nM
Citation Maingot, MBlayo, ALDenoyelle, SM'Kadmi, CDamian, MMary, SGagne, DSanchez, PAicher, BSchmidt, PMüller, GTeifel, MGünther, EMarie, JBanères, JLMartinez, JFehrentz, JA New ligands of the ghrelin receptor based on the 1,2,4-triazole scaffold by introduction of a second chiral center. Bioorg Med Chem Lett26:2408-12 (2016) 
 
Growth hormone secretagogue receptor type 1
Name:Growth hormone secretagogue receptor type 1
Type:Receptor
Mol. Mass.:41334.57
Organism:Homo sapiens (Human)
Description:Receptor binding studies use plasma membranes from LLC PK-1 cells transiently transfected with hGHSR1a.
Residue:366
BDBM102979
NameBDBM102979
Synonyms:US8546435, 7
TypeSmall organic molecule
Emp. Form.C35H39N7O4
Mol. Mass.621.7287
SMILESCOc1ccc(Cn2c(nnc2[C@@H](Cc2ccccc2)NC(C)=O)[C@@H](Cc2c[nH]c3ccccc23)NC(=O)[C@@H]2CNCCO2)cc1