Reaction Details
TargetCannabinoid receptor 1
LigandBDBM50165680
Substrate/Competitorn/a
Meas. Tech.ChEMBL_1574214 (CHEMBL3802219)
Ki 826±n/a nM
Citation Bertini, SChicca, AArena, CChicca, SSaccomanni, GGertsch, JManera, CMacchia, M Synthesis and pharmacological evaluation of new biphenylic derivatives as CB2 receptor ligands. Eur J Med Chem116:252-266 (2016) 
 
Cannabinoid receptor 1
Name:Cannabinoid receptor 1
Type:G Protein-Coupled Receptor (GPCR)
Mol. Mass.:52868.96
Organism:Homo sapiens (Human)
Description:P21554
Residue:472
BDBM50165680
NameBDBM50165680
Synonyms:CHEMBL3799040
TypeSmall organic molecule
Emp. Form.C28H30FNO2
Mol. Mass.431.5417
SMILESCOc1c(Cc2ccc(F)cc2)cc(cc1C(=O)N[C@@H]1CC[C@H](C)CC1)-c1ccccc1