Reaction Details
TargetCannabinoid receptor 2
LigandBDBM50165688
Substrate/Competitorn/a
Meas. Tech.ChEMBL_1574215 (CHEMBL3802220)
Ki>10000±n/a nM
Citation Bertini, SChicca, AArena, CChicca, SSaccomanni, GGertsch, JManera, CMacchia, M Synthesis and pharmacological evaluation of new biphenylic derivatives as CB2 receptor ligands. Eur J Med Chem116:252-266 (2016) 
 
Cannabinoid receptor 2
Name:Cannabinoid receptor 2
Type:G Protein-Coupled Receptor (GPCR)
Mol. Mass.:39690.94
Organism:Homo sapiens (Human)
Description:P34972
Residue:360
BDBM50165688
NameBDBM50165688
Synonyms:CHEMBL3798273
TypeSmall organic molecule
Emp. Form.C37H55NO3
Mol. Mass.561.8375
(=O)Nc1cc(CC=C)cc(c1O)-c1ccc(OC)c(CC=C)c1