Reaction Details
TargetCannabinoid receptor 2
LigandBDBM50165676
Substrate/Competitorn/a
Meas. Tech.ChEMBL_1574215 (CHEMBL3802220)
Ki 1086±n/a nM
Citation Bertini, SChicca, AArena, CChicca, SSaccomanni, GGertsch, JManera, CMacchia, M Synthesis and pharmacological evaluation of new biphenylic derivatives as CB2 receptor ligands. Eur J Med Chem116:252-266 (2016) 
 
Cannabinoid receptor 2
Name:Cannabinoid receptor 2
Type:G Protein-Coupled Receptor (GPCR)
Mol. Mass.:39690.94
Organism:Homo sapiens (Human)
Description:P34972
Residue:360
BDBM50165676
NameBDBM50165676
Synonyms:CHEMBL3799406
TypeSmall organic molecule
Emp. Form.C28H29F2NO2
Mol. Mass.449.5322
SMILESCOc1c(Cc2ccc(F)cc2)cc(cc1C(=O)N[C@H]1CC[C@H](C)CC1)-c1ccc(F)cc1