Reaction Details
TargetCannabinoid receptor 2
LigandBDBM50165681
Substrate/Competitorn/a
Meas. Tech.ChEMBL_1574215 (CHEMBL3802220)
Ki 2617±n/a nM
Citation Bertini, SChicca, AArena, CChicca, SSaccomanni, GGertsch, JManera, CMacchia, M Synthesis and pharmacological evaluation of new biphenylic derivatives as CB2 receptor ligands. Eur J Med Chem116:252-266 (2016) 
 
Cannabinoid receptor 2
Name:Cannabinoid receptor 2
Type:G Protein-Coupled Receptor (GPCR)
Mol. Mass.:39690.94
Organism:Homo sapiens (Human)
Description:P34972
Residue:360
BDBM50165681
NameBDBM50165681
Synonyms:CHEMBL3797270
TypeSmall organic molecule
Emp. Form.C28H30FNO2
Mol. Mass.431.5417
SMILESCOc1c(Cc2ccc(F)cc2)cc(cc1C(=O)N[C@H]1CC[C@H](C)CC1)-c1ccccc1