Reaction Details
TargetCannabinoid receptor 1
LigandBDBM50165691
Substrate/Competitorn/a
Meas. Tech.ChEMBL_1574214 (CHEMBL3802219)
Ki 615±n/a nM
Citation Bertini, SChicca, AArena, CChicca, SSaccomanni, GGertsch, JManera, CMacchia, M Synthesis and pharmacological evaluation of new biphenylic derivatives as CB2 receptor ligands. Eur J Med Chem116:252-266 (2016) 
 
Cannabinoid receptor 1
Name:Cannabinoid receptor 1
Type:G Protein-Coupled Receptor (GPCR)
Mol. Mass.:52868.96
Organism:Homo sapiens (Human)
Description:P21554
Residue:472
BDBM50165691
NameBDBM50165691
Synonyms:CHEMBL3799723
TypeSmall organic molecule
Emp. Form.C22H26O2
Mol. Mass.322.4406
SMILESCCCCOc1ccc(cc1CC=C)-c1cc(CC=C)ccc1O