Reaction Details
TargetLeucine-rich repeat serine/threonine-protein kinase 2
LigandBDBM50165993
Substrate/Competitorn/a
Meas. Tech.ChEMBL_1575145 (CHEMBL3804653)
Ki 389±n/a nM
Citation Greshock, TJSanders, JMDrolet, RERajapakse, HAChang, RKKim, BRada, VLTiscia, HESu, HLai, MTSur, SMSanchez, RIBilodeau, MTRenger, JJKern, JTMcCauley, JA Potent, selective and orally bioavailable leucine-rich repeat kinase 2 (LRRK2) inhibitors. Bioorg Med Chem Lett26:2631-5 (2016) 
 
Leucine-rich repeat serine/threonine-protein kinase 2
Name:Leucine-rich repeat serine/threonine-protein kinase 2
Type:Protein
Mol. Mass.:286113.20
Organism:Homo sapiens (Human)
Description:Q5S007
Residue:2527
BDBM50165993
NameBDBM50165993
Synonyms:CHEMBL3800282
TypeSmall organic molecule
Emp. Form.C18H22N2OS2
Mol. Mass.346.51
SMILESCC1(C)Cc2c(sc(SC3CCCC3)c2C(=O)C1)-c1cc[nH]n1