Reaction Details
TargetLeucine-rich repeat serine/threonine-protein kinase 2
LigandBDBM50110703
Substrate/Competitorn/a
Meas. Tech.ChEMBL_1575145 (CHEMBL3804653)
Ki 377±n/a nM
Citation Greshock, TJSanders, JMDrolet, RERajapakse, HAChang, RKKim, BRada, VLTiscia, HESu, HLai, MTSur, SMSanchez, RIBilodeau, MTRenger, JJKern, JTMcCauley, JA Potent, selective and orally bioavailable leucine-rich repeat kinase 2 (LRRK2) inhibitors. Bioorg Med Chem Lett26:2631-5 (2016) 
 
Leucine-rich repeat serine/threonine-protein kinase 2
Name:Leucine-rich repeat serine/threonine-protein kinase 2
Type:Protein
Mol. Mass.:286113.20
Organism:Homo sapiens (Human)
Description:Q5S007
Residue:2527
BDBM50110703
NameBDBM50110703
Synonyms:6,6-Dimethyl-3-methylsulfanyl-1-(1H-pyrazol-3-yl)-6,7-dihydro-5H-benzo[c]thiophen-4-one | CHEMBL17354
TypeSmall organic molecule
Emp. Form.C14H16N2OS2
Mol. Mass.292.42
SMILESCSc1sc(-c2cc[nH]n2)c2CC(C)(C)CC(=O)c12