Reaction Details
TargetLeucine-rich repeat serine/threonine-protein kinase 2
LigandBDBM50166003
Substrate/Competitorn/a
Meas. Tech.ChEMBL_1575146 (CHEMBL3804654)
Ki 286±n/a nM
Citation Greshock, TJSanders, JMDrolet, RERajapakse, HAChang, RKKim, BRada, VLTiscia, HESu, HLai, MTSur, SMSanchez, RIBilodeau, MTRenger, JJKern, JTMcCauley, JA Potent, selective and orally bioavailable leucine-rich repeat kinase 2 (LRRK2) inhibitors. Bioorg Med Chem Lett26:2631-5 (2016) 
 
Leucine-rich repeat serine/threonine-protein kinase 2
Name:Leucine-rich repeat serine/threonine-protein kinase 2
Type:Protein
Mol. Mass.:286113.20
Organism:Homo sapiens (Human)
Description:Q5S007
Residue:2527
BDBM50166003
NameBDBM50166003
Synonyms:CHEMBL3797718
TypeSmall organic molecule
Emp. Form.C15H17N3OS2
Mol. Mass.319.445
SMILESO=C1NCCc2c(sc(SC3CCCC3)c12)-c1cc[nH]n1