Reaction Details
TargetMitogen-activated protein kinase 3
LigandBDBM50166410
Substrate/Competitorn/a
Meas. Tech.ChEMBL_1575390 (CHEMBL3802287)
IC50 46±n/a nM
Citation Li, LLiu, FJin, NTang, SChen, ZYang, XDing, JGeng, MJiang, LHuang, MCao, J Discovery and structure activity relationship study of novel indazole amide inhibitors for extracellular signal-regulated kinase1/2 (ERK1/2). Bioorg Med Chem Lett26:2600-4 (2016) 
 
Mitogen-activated protein kinase 3
Name:Mitogen-activated protein kinase 3
Type:Protein
Mol. Mass.:43136.58
Organism:Homo sapiens (Human)
Description:curated by PDB 4QTB
Residue:379
BDBM50166410
NameBDBM50166410
Synonyms:CHEMBL3800263
TypeSmall organic molecule
Emp. Form.C20H15ClN4O
Mol. Mass.362.812
SMILESClc1ccccc1CNC(=O)c1ccc2[nH]nc(-c3ccncc3)c2c1