Reaction Details
TargetMitogen-activated protein kinase 1
LigandBDBM50166566
Substrate/Competitorn/a
Meas. Tech.ChEMBL_1575391 (CHEMBL3802288)
IC50 110±n/a nM
Citation Li, LLiu, FJin, NTang, SChen, ZYang, XDing, JGeng, MJiang, LHuang, MCao, J Discovery and structure activity relationship study of novel indazole amide inhibitors for extracellular signal-regulated kinase1/2 (ERK1/2). Bioorg Med Chem Lett26:2600-4 (2016) 
 
Mitogen-activated protein kinase 1
Name:Mitogen-activated protein kinase 1
Type:Ser/Thr Protein Kinase
Mol. Mass.:41392.76
Organism:Homo sapiens (Human)
Description:P28482
Residue:360
BDBM50166566
NameBDBM50166566
Synonyms:CHEMBL3797371
TypeSmall organic molecule
Emp. Form.C23H21ClN4O
Mol. Mass.404.892
SMILESCC(NC(=O)c1ccc2[nH]nc(-c3cc(C)nc(C)c3)c2c1)c1cccc(Cl)c1