Reaction Details
TargetFibroblast growth factor receptor 1
LigandBDBM50166350
Substrate/Competitorn/a
Meas. Tech.ChEMBL_1575404 (CHEMBL3802301)
IC50>1000±n/a nM
Citation Li, LLiu, FJin, NTang, SChen, ZYang, XDing, JGeng, MJiang, LHuang, MCao, J Discovery and structure activity relationship study of novel indazole amide inhibitors for extracellular signal-regulated kinase1/2 (ERK1/2). Bioorg Med Chem Lett26:2600-4 (2016) 
 
Fibroblast growth factor receptor 1
Name:Fibroblast growth factor receptor 1
Type:Receptor
Mol. Mass.:91861.70
Organism:Homo sapiens (Human)
Description:P11362
Residue:822
BDBM50166350
NameBDBM50166350
Synonyms:CHEMBL3798631
TypeSmall organic molecule
Emp. Form.C21H17ClN4O
Mol. Mass.376.839
SMILESCC(NC(=O)c1ccc2[nH]nc(-c3ccncc3)c2c1)c1cccc(Cl)c1