Reaction Details
TargetProtein kinase C theta type
LigandBDBM50164191
Substrate/Competitorn/a
Meas. Tech.ChEMBL_1576560 (CHEMBL3804231)
IC50 170±n/a nM
Citation Katoh, TTakai, TYukawa, TTsukamoto, TWatanabe, EMototani, HArita, THayashi, HNakagawa, HKlein, MGZou, HSang, BCSnell, GNakada, Y Discovery and optimization of 1,7-disubstituted-2,2-dimethyl-2,3-dihydroquinazolin-4(1H)-ones as potent and selective PKC¿ inhibitors. Bioorg Med Chem24:2466-75 (2016) 
 
Protein kinase C theta type
Name:Protein kinase C theta type
Type:Serine/threonine-protein kinase
Mol. Mass.:81878.04
Organism:Homo sapiens (Human)
Description:Full-length human PKC theta (Panvera Catalog No. P2996).
Residue:706
BDBM50164191
NameBDBM50164191
Synonyms:CHEMBL3798787
TypeSmall organic molecule
Emp. Form.C20H21N5O2
Mol. Mass.363.413
SMILESCC1(C)NC(=O)c2ccc(cc2N1CC1CC1)-n1c2cccnc2[nH]c1=O