Reaction Details
TargetProtein kinase C theta type
LigandBDBM50166600
Substrate/Competitorn/a
Meas. Tech.ChEMBL_1576560 (CHEMBL3804231)
IC50 240±n/a nM
Citation Katoh, TTakai, TYukawa, TTsukamoto, TWatanabe, EMototani, HArita, THayashi, HNakagawa, HKlein, MGZou, HSang, BCSnell, GNakada, Y Discovery and optimization of 1,7-disubstituted-2,2-dimethyl-2,3-dihydroquinazolin-4(1H)-ones as potent and selective PKC¿ inhibitors. Bioorg Med Chem24:2466-75 (2016) 
 
Protein kinase C theta type
Name:Protein kinase C theta type
Type:Serine/threonine-protein kinase
Mol. Mass.:81878.04
Organism:Homo sapiens (Human)
Description:Full-length human PKC theta (Panvera Catalog No. P2996).
Residue:706
BDBM50166600
NameBDBM50166600
Synonyms:CHEMBL3799887
TypeSmall organic molecule
Emp. Form.C16H20N4O
Mol. Mass.284.3562
SMILESCCN1c2cc(ccc2C(=O)NC1(C)C)-c1c[nH]nc1C