Reaction Details
TargetCasein kinase I isoform delta
LigandBDBM50166588
Substrate/Competitorn/a
Meas. Tech.ChEMBL_1576574 (CHEMBL3804489)
IC50>1000±n/a nM
Citation Katoh, TTakai, TYukawa, TTsukamoto, TWatanabe, EMototani, HArita, THayashi, HNakagawa, HKlein, MGZou, HSang, BCSnell, GNakada, Y Discovery and optimization of 1,7-disubstituted-2,2-dimethyl-2,3-dihydroquinazolin-4(1H)-ones as potent and selective PKC¿ inhibitors. Bioorg Med Chem24:2466-75 (2016) 
 
Casein kinase I isoform delta
Name:Casein kinase I isoform delta
Type:Enzyme
Mol. Mass.:47356.76
Organism:Homo sapiens (Human)
Description:P48730
Residue:415
BDBM50166588
NameBDBM50166588
Synonyms:CHEMBL3798011
TypeSmall organic molecule
Emp. Form.C24H23N5O2
Mol. Mass.413.4717
SMILESC[C@@H](N1c2cc(ccc2C(=O)NC1(C)C)-n1c2cccnc2[nH]c1=O)c1ccccc1