Reaction Details
TargetBeta-2 adrenergic receptor
LigandBDBM50167064
Substrate/Competitorn/a
Meas. Tech.ChEMBL_1573519 (CHEMBL3801474)
Ki 97±n/a nM
Citation Weichert, DStanek, MHübner, HGmeiner, P Structure-guided development of dualß2 adrenergic/dopamine D2 receptor agonists. Bioorg Med Chem24:2641-53 (2016) 
 
Beta-2 adrenergic receptor
Name:Beta-2 adrenergic receptor
Type:n/a
Mol. Mass.:46461.69
Organism:Homo sapiens (Human)
Description:P07550
Residue:413
BDBM50167064
NameBDBM50167064
Synonyms:CHEMBL3797876
TypeSmall organic molecule
Emp. Form.C17H21NO5
Mol. Mass.319.3523
SMILESCOc1ccccc1OCCNC[C@H](O)c1ccc(O)c(O)c1