Reaction Details
TargetBeta-2 adrenergic receptor
LigandBDBM50167072
Substrate/Competitorn/a
Meas. Tech.ChEMBL_1573519 (CHEMBL3801474)
Ki 0.034000±n/a nM
Citation Weichert, DStanek, MHübner, HGmeiner, P Structure-guided development of dualß2 adrenergic/dopamine D2 receptor agonists. Bioorg Med Chem24:2641-53 (2016) 
 
Beta-2 adrenergic receptor
Name:Beta-2 adrenergic receptor
Type:n/a
Mol. Mass.:46461.69
Organism:Homo sapiens (Human)
Description:P07550
Residue:413
BDBM50167072
NameBDBM50167072
Synonyms:CHEMBL3799125
TypeSmall organic molecule
Emp. Form.C24H26N2O4
Mol. Mass.406.4742
SMILESCOc1ccccc1OCCNC[C@H](O)COc1cccc2[nH]c3ccccc3c12