Reaction Details
TargetD(2) dopamine receptor
LigandBDBM50029050
Substrate/Competitorn/a
Meas. Tech.ChEMBL_1573522 (CHEMBL3801477)
Ki 910±n/a nM
Citation Weichert, DStanek, MHübner, HGmeiner, P Structure-guided development of dualß2 adrenergic/dopamine D2 receptor agonists. Bioorg Med Chem24:2641-53 (2016) 
 
D(2) dopamine receptor
Name:D(2) dopamine receptor
Type:Cell-surface receptors
Mol. Mass.:50647.10
Organism:Homo sapiens (Human)
Description:P14416
Residue:443
BDBM50029050
NameBDBM50029050
Synonyms:(-)-(R)-epinephrine (-)-adrenaline (R)-adrenaline Adrenalin EPINEPHRINE levoepinephrine
TypeSmall organic molecule
Emp. Form.C9H13NO3
Mol. Mass.183.2044
SMILESCNC[C@H](O)c1ccc(O)c(O)c1