Reaction Details
TargetD(3) dopamine receptor
LigandBDBM50167066
Substrate/Competitorn/a
Meas. Tech.ChEMBL_1573523 (CHEMBL3801478)
Ki 1700±n/a nM
Citation Weichert, DStanek, MHübner, HGmeiner, P Structure-guided development of dualß2 adrenergic/dopamine D2 receptor agonists. Bioorg Med Chem24:2641-53 (2016) 
 
D(3) dopamine receptor
Name:D(3) dopamine receptor
Type:n/a
Mol. Mass.:44243.43
Organism:Homo sapiens (Human)
Description:n/a
Residue:400
BDBM50167066
NameBDBM50167066
Synonyms:CHEMBL3800400
TypeSmall organic molecule
Emp. Form.C29H32N2O5
Mol. Mass.488.5748
SMILESCOc1cc(CCNC[C@H](O)c2ccc(O)c3[nH]c(=O)ccc23)ccc1OCCCc1ccccc1