Reaction Details
TargetD(3) dopamine receptor
LigandBDBM50166977
Substrate/Competitorn/a
Meas. Tech.ChEMBL_1573523 (CHEMBL3801478)
Ki 62±n/a nM
Citation Weichert, DStanek, MHübner, HGmeiner, P Structure-guided development of dualß2 adrenergic/dopamine D2 receptor agonists. Bioorg Med Chem24:2641-53 (2016) 
 
D(3) dopamine receptor
Name:D(3) dopamine receptor
Type:n/a
Mol. Mass.:44243.43
Organism:Homo sapiens (Human)
Description:n/a
Residue:400
BDBM50166977
NameBDBM50166977
Synonyms:CHEMBL3800303
TypeSmall organic molecule
Emp. Form.C26H31NO5
Mol. Mass.437.528
SMILESCOc1cc(CCNC[C@H](O)c2ccc(O)c(O)c2)ccc1OCCCc1ccccc1