Reaction Details
TargetD(3) dopamine receptor
LigandBDBM50166979
Substrate/Competitorn/a
Meas. Tech.ChEMBL_1573523 (CHEMBL3801478)
Ki 690±n/a nM
Citation Weichert, DStanek, MHübner, HGmeiner, P Structure-guided development of dualß2 adrenergic/dopamine D2 receptor agonists. Bioorg Med Chem24:2641-53 (2016) 
 
D(3) dopamine receptor
Name:D(3) dopamine receptor
Type:n/a
Mol. Mass.:44243.43
Organism:Homo sapiens (Human)
Description:n/a
Residue:400
BDBM50166979
NameBDBM50166979
Synonyms:CHEMBL3798748
TypeSmall organic molecule
Emp. Form.C28H32N2O6
Mol. Mass.492.5635
SMILESCOc1cc(CCNC[C@H](O)c2ccc(O)c3NC(=O)COc23)ccc1OCCCc1ccccc1