Reaction Details
TargetD(3) dopamine receptor
LigandBDBM50018958
Substrate/Competitorn/a
Meas. Tech.ChEMBL_1573523 (CHEMBL3801478)
Ki 15±n/a nM
Citation Weichert, DStanek, MHübner, HGmeiner, P Structure-guided development of dualß2 adrenergic/dopamine D2 receptor agonists. Bioorg Med Chem24:2641-53 (2016) 
 
D(3) dopamine receptor
Name:D(3) dopamine receptor
Type:n/a
Mol. Mass.:44243.43
Organism:Homo sapiens (Human)
Description:n/a
Residue:400
BDBM50018958
NameBDBM50018958
Synonyms:CHEBI:75401 | QUINPIROLE
TypeSmall organic molecule
Emp. Form.C13H21N3
Mol. Mass.219.3259
SMILES[H][C@]12CCCN(CCC)[C@]1([H])Cc1c[nH]nc1C2