Reaction Details
TargetD(4) dopamine receptor
LigandBDBM50167066
Substrate/Competitorn/a
Meas. Tech.ChEMBL_1573524 (CHEMBL3801479)
Ki 3300±n/a nM
Citation Weichert, DStanek, MHübner, HGmeiner, P Structure-guided development of dualß2 adrenergic/dopamine D2 receptor agonists. Bioorg Med Chem24:2641-53 (2016) 
 
D(4) dopamine receptor
Name:D(4) dopamine receptor
Type:Enzyme
Mol. Mass.:48373.19
Organism:Homo sapiens (Human)
Description:P21917
Residue:419
BDBM50167066
NameBDBM50167066
Synonyms:CHEMBL3800400
TypeSmall organic molecule
Emp. Form.C29H32N2O5
Mol. Mass.488.5748
SMILESCOc1cc(CCNC[C@H](O)c2ccc(O)c3[nH]c(=O)ccc23)ccc1OCCCc1ccccc1