Reaction Details
TargetD(4) dopamine receptor
LigandBDBM50166978
Substrate/Competitorn/a
Meas. Tech.ChEMBL_1573524 (CHEMBL3801479)
Ki 38±n/a nM
Citation Weichert, DStanek, MHübner, HGmeiner, P Structure-guided development of dualß2 adrenergic/dopamine D2 receptor agonists. Bioorg Med Chem24:2641-53 (2016) 
 
D(4) dopamine receptor
Name:D(4) dopamine receptor
Type:Enzyme
Mol. Mass.:48373.19
Organism:Homo sapiens (Human)
Description:P21917
Residue:419
BDBM50166978
NameBDBM50166978
Synonyms:CHEMBL3800636
TypeSmall organic molecule
Emp. Form.C26H31NO4
Mol. Mass.421.5286
SMILESCOc1cc(CCNCCc2ccc(O)c(O)c2)ccc1OCCCc1ccccc1