Reaction Details
TargetTryptophan 5-hydroxylase 1
LigandBDBM50167395
Substrate/Competitorn/a
Meas. Tech.ChEBML_1574259
IC50 15±n/a nM
Citation Goldberg, DRDe Lombaert, SAiello, RBourassa, PBarucci, NZhang, QParalkar, VStein, AJValentine, JZavadoski, W Discovery of acyl guanidine tryptophan hydroxylase-1 inhibitors. Bioorg Med Chem Lett26:2855-2860 (2016) 
 
Tryptophan 5-hydroxylase 1
Name:Tryptophan 5-hydroxylase 1
Type:PROTEIN
Mol. Mass.:50990.64
Organism:Homo sapiens (Human)
Description:ChEMBL_1361824
Residue:444
BDBM50167395
NameBDBM50167395
Synonyms:CHEMBL3799737
TypeSmall organic molecule
Emp. Form.C29H32ClN5O4
Mol. Mass.550.048
SMILESN[C@@H](Cc1ccc(cc1)C(=O)\N=C(/N)NCc1c(Oc2ccccc2Cl)cccc1N1CCCCC1)C(O)=O