Reaction Details
TargetMacrophage migration inhibitory factor
LigandBDBM50349068
Substrate/Competitorn/a
Meas. Tech.ChEMBL_1574566 (CHEMBL3804638)
Ki 10000±n/a nM
Citation Cisneros, JARobertson, MJValhondo, MJorgensen, WL Irregularities in enzyme assays: The case of macrophage migration inhibitory factor. Bioorg Med Chem Lett26:2764-2767 (2016) 
 
Macrophage migration inhibitory factor
Name:Macrophage migration inhibitory factor
Type:Enzyme
Mol. Mass.:12478.18
Organism:Homo sapiens (Human)
Description:P14174
Residue:115
BDBM50349068
NameBDBM50349068
Synonyms:CHEMBL1807940
TypeSmall organic molecule
Emp. Form.C13H8ClNO2S
Mol. Mass.277.726
SMILESOc1ccc2c(c1)sn(-c1ccc(Cl)cc1)c2=O