Reaction Details
TargetMacrophage migration inhibitory factor
LigandBDBM50013041
Substrate/Competitorn/a
Meas. Tech.ChEMBL_1574567 (CHEMBL3804639)
Ki 26790±n/a nM
Citation Cisneros, JARobertson, MJValhondo, MJorgensen, WL Irregularities in enzyme assays: The case of macrophage migration inhibitory factor. Bioorg Med Chem Lett26:2764-2767 (2016) 
 
Macrophage migration inhibitory factor
Name:Macrophage migration inhibitory factor
Type:Enzyme
Mol. Mass.:12478.18
Organism:Homo sapiens (Human)
Description:P14174
Residue:115
BDBM50013041
NameBDBM50013041
Synonyms:CHEMBL3261385
TypeSmall organic molecule
Emp. Form.C18H14N2O5S
Mol. Mass.370.379
SMILESCOc1ccc(cc1NC(=S)NC(=O)c1cc2ccccc2o1)C(O)=O