Reaction Details
TargetNAD-dependent protein deacetylase sirtuin-2
LigandBDBM50168843
Substrate/Competitorn/a
Meas. Tech.ChEMBL_1577526 (CHEMBL3806935)
IC50 42±n/a nM
Citation Ai, TWilson, DJMore, SSXie, JChen, L 5-((3-Amidobenzyl)oxy)nicotinamides as Sirtuin 2 Inhibitors. J Med Chem59:2928-41 (2016) 
 
NAD-dependent protein deacetylase sirtuin-2
Name:NAD-dependent protein deacetylase sirtuin-2
Type:Hydrolase
Mol. Mass.:43172.62
Organism:Homo sapiens (Human)
Description:n/a
Residue:389
BDBM50168843
NameBDBM50168843
Synonyms:CHEMBL3805831
TypeSmall organic molecule
Emp. Form.C22H17N3O3
Mol. Mass.371.3887
SMILESNC(=O)c1cncc(OCc2cccc(NC(=O)c3ccc(cc3)C#C)c2)c1