Reaction Details
TargetNAD-dependent protein deacetylase sirtuin-2
LigandBDBM50168931
Substrate/Competitorn/a
Meas. Tech.ChEMBL_1577526 (CHEMBL3806935)
IC50 29±n/a nM
Citation Ai, TWilson, DJMore, SSXie, JChen, L 5-((3-Amidobenzyl)oxy)nicotinamides as Sirtuin 2 Inhibitors. J Med Chem59:2928-41 (2016) 
 
NAD-dependent protein deacetylase sirtuin-2
Name:NAD-dependent protein deacetylase sirtuin-2
Type:Hydrolase
Mol. Mass.:43172.62
Organism:Homo sapiens (Human)
Description:n/a
Residue:389
BDBM50168931
NameBDBM50168931
Synonyms:CHEMBL3805639
TypeSmall organic molecule
Emp. Form.C23H18N4O4
Mol. Mass.414.4134
SMILESNC(=O)c1cncc(OCc2cccc(NC(=O)c3ccc(nc3)-c3ccco3)c2)c1