Reaction Details
TargetNAD-dependent protein deacetylase sirtuin-3, mitochondrial
LigandBDBM50168921
Substrate/Competitorn/a
Meas. Tech.ChEMBL_1577532 (CHEMBL3806941)
Ki 7200±n/a nM
Citation Ai, TWilson, DJMore, SSXie, JChen, L 5-((3-Amidobenzyl)oxy)nicotinamides as Sirtuin 2 Inhibitors. J Med Chem59:2928-41 (2016) 
 
NAD-dependent protein deacetylase sirtuin-3, mitochondrial
Name:NAD-dependent protein deacetylase sirtuin-3, mitochondrial
Type:Protein
Mol. Mass.:43582.69
Organism:Homo sapiens (Human)
Description:Q9NTG7
Residue:399
BDBM50168921
NameBDBM50168921
Synonyms:CHEMBL3806257
TypeSmall organic molecule
Emp. Form.C19H16N4O3
Mol. Mass.348.3553
SMILESNC(=O)c1cncc(OCc2cccc(NC(=O)c3ccncc3)c2)c1