Reaction Details
TargetPoly [ADP-ribose] polymerase tankyrase-1
LigandBDBM50169058
Substrate/Competitorn/a
Meas. Tech.ChEMBL_1577625 (CHEMBL3807233)
IC50 0.810±n/a nM
Citation Abdel-Magid, AF Potential Use of Inhibitors of Tankyrases and PARP-1 as Treatment for Cancer and Other Diseases. ACS Med Chem Lett7:209-10 (2016) 
 
Poly [ADP-ribose] polymerase tankyrase-1
Name:Poly [ADP-ribose] polymerase tankyrase-1
Type:Enzyme
Mol. Mass.:142058.03
Organism:Homo sapiens (Human)
Description:O95271
Residue:1327
BDBM50169058
NameBDBM50169058
Synonyms:CHEMBL3806049
TypeSmall organic molecule
Emp. Form.C23H30N6O3
Mol. Mass.438.5227
SMILESCC(C)n1cc(cn1)C(=O)C1CCN(CC1)C(=O)CCCc1nc2n(C)ccc2c(=O)[nH]1