Reaction Details
TargetSigma non-opioid intracellular receptor 1
LigandBDBM50170024
Substrate/Competitorn/a
Meas. Tech.ChEMBL_1576906 (CHEMBL3806615)
Ki 5.0±n/a nM
Citation Cao, XChen, YZhang, YLan, YZhang, JXu, XQiu, YZhao, SLiu, XLiu, BFZhang, G Synthesis and Biological Evaluation of Novels1 Receptor Ligands for Treating Neuropathic Pain: 6-Hydroxypyridazinones. J Med Chem59:2942-61 (2016) 
 
Sigma non-opioid intracellular receptor 1
Name:Sigma non-opioid intracellular receptor 1
Type:Protein
Mol. Mass.:25307.17
Organism:Cavia porcellus (Guinea pig)
Description:Q60492
Residue:223
BDBM50170024
NameBDBM50170024
Synonyms:CHEMBL3806193
TypeSmall organic molecule
Emp. Form.C19H23Cl2N3O2
Mol. Mass.396.311
SMILESCC1CCN(CCCOc2ccc(=O)n(n2)-c2ccc(Cl)c(Cl)c2)CC1