Reaction Details
TargetD-amino-acid oxidase
LigandBDBM50170227
Substrate/Competitorn/a
Meas. Tech.ChEMBL_1577592 (CHEMBL3807136)
IC50 340±n/a nM
Citation Xie, DLu, JXie, JCui, JLi, TFWang, YCChen, YGong, NLi, XYFu, LWang, YX Discovery and analgesic evaluation of 8-chloro-1,4-dihydropyrido[2,3-b]pyrazine-2,3-dione as a novel potent d-amino acid oxidase inhibitor. Eur J Med Chem117:19-32 (2016) 
 
D-amino-acid oxidase
Name:D-amino-acid oxidase
Type:Homodimer
Mol. Mass.:39476.06
Organism:Homo sapiens (Human)
Description:P14920
Residue:347
BDBM50170227
NameBDBM50170227
Synonyms:CHEMBL3805642
TypeSmall organic molecule
Emp. Form.C8H6FN3O2
Mol. Mass.195.1505
SMILESCc1c(F)cnc2[nH]c(=O)c(=O)[nH]c12