Reaction Details
TargetD-amino-acid oxidase
LigandBDBM50170231
Substrate/Competitorn/a
Meas. Tech.ChEMBL_1577590 (CHEMBL3807134)
IC50 530±n/a nM
Citation Xie, DLu, JXie, JCui, JLi, TFWang, YCChen, YGong, NLi, XYFu, LWang, YX Discovery and analgesic evaluation of 8-chloro-1,4-dihydropyrido[2,3-b]pyrazine-2,3-dione as a novel potent d-amino acid oxidase inhibitor. Eur J Med Chem117:19-32 (2016) 
 
D-amino-acid oxidase
Name:D-amino-acid oxidase
Type:Flavoprotein
Mol. Mass.:39338.01
Organism:Sus scrofa (pig)
Description:Homodimer.
Residue:347
BDBM50170231
NameBDBM50170231
Synonyms:CHEMBL3806101
TypeSmall organic molecule
Emp. Form.C7H3Br2N3O2
Mol. Mass.320.926
SMILESBrc1cnc2[nH]c(=O)c(=O)[nH]c2c1Br