Reaction Details
TargetD-amino-acid oxidase
LigandBDBM50170246
Substrate/Competitorn/a
Meas. Tech.ChEMBL_1577590 (CHEMBL3807134)
IC50 460±n/a nM
Citation Xie, DLu, JXie, JCui, JLi, TFWang, YCChen, YGong, NLi, XYFu, LWang, YX Discovery and analgesic evaluation of 8-chloro-1,4-dihydropyrido[2,3-b]pyrazine-2,3-dione as a novel potent d-amino acid oxidase inhibitor. Eur J Med Chem117:19-32 (2016) 
 
D-amino-acid oxidase
Name:D-amino-acid oxidase
Type:Flavoprotein
Mol. Mass.:39338.01
Organism:Sus scrofa (pig)
Description:Homodimer.
Residue:347
BDBM50170246
NameBDBM50170246
Synonyms:CHEMBL3806244
TypeSmall organic molecule
Emp. Form.C7H4FN3O2
Mol. Mass.181.124
SMILESFc1cnc2[nH]c(=O)c(=O)[nH]c2c1