Reaction Details
TargetAminopeptidase N
LigandBDBM50170874
Substrate/Competitorn/a
Meas. Tech.ChEMBL_1577952 (CHEMBL3806576)
Ki 6040±n/a nM
Citation Weglarz-Tomczak, EBerlicki, LPawelczak, MNocek, BJoachimiak, AMucha, A A structural insight into the P1S1 binding mode of diaminoethylphosphonic and phosphinic acids, selective inhibitors of alanine aminopeptidases. Eur J Med Chem117:187-96 (2016) 
 
Aminopeptidase N
Name:Aminopeptidase N
Type:Protein
Mol. Mass.:108810.25
Organism:Sus scrofa (Pig)
Description:P15145
Residue:963
BDBM50170874
NameBDBM50170874
Synonyms:CHEMBL3805544
TypeSmall organic molecule
Emp. Form.C10H17N2O3P
Mol. Mass.244.2273
SMILESNC(CNCCc1ccccc1)P(O)(O)=O