Reaction Details
TargetAminopeptidase N
LigandBDBM50170895
Substrate/Competitorn/a
Meas. Tech.ChEMBL_1577952 (CHEMBL3806576)
Ki 3640±n/a nM
Citation Weglarz-Tomczak, EBerlicki, LPawelczak, MNocek, BJoachimiak, AMucha, A A structural insight into the P1S1 binding mode of diaminoethylphosphonic and phosphinic acids, selective inhibitors of alanine aminopeptidases. Eur J Med Chem117:187-96 (2016) 
 
Aminopeptidase N
Name:Aminopeptidase N
Type:Protein
Mol. Mass.:108810.25
Organism:Sus scrofa (Pig)
Description:P15145
Residue:963
BDBM50170895
NameBDBM50170895
Synonyms:CHEMBL3805487
TypeSmall organic molecule
Emp. Form.C7H17N2O4P
Mol. Mass.224.1946
SMILESNC(CNCC1CCCO1)P(O)(O)=O