Reaction Details
TargetAminopeptidase N
LigandBDBM50170875
Substrate/Competitorn/a
Meas. Tech.ChEMBL_1577952 (CHEMBL3806576)
Ki 2490±n/a nM
Citation Weglarz-Tomczak, EBerlicki, LPawelczak, MNocek, BJoachimiak, AMucha, A A structural insight into the P1S1 binding mode of diaminoethylphosphonic and phosphinic acids, selective inhibitors of alanine aminopeptidases. Eur J Med Chem117:187-96 (2016) 
 
Aminopeptidase N
Name:Aminopeptidase N
Type:Protein
Mol. Mass.:108810.25
Organism:Sus scrofa (Pig)
Description:P15145
Residue:963
BDBM50170875
NameBDBM50170875
Synonyms:CHEMBL3805288
TypeSmall organic molecule
Emp. Form.C9H16N3O3P
Mol. Mass.245.2154
SMILESNC(CNCc1ccc(N)cc1)P(O)(O)=O