Reaction Details
TargetAminopeptidase N
LigandBDBM50170871
Substrate/Competitorn/a
Meas. Tech.ChEMBL_1577953 (CHEMBL3806577)
Ki 3220±n/a nM
Citation Weglarz-Tomczak, EBerlicki, LPawelczak, MNocek, BJoachimiak, AMucha, A A structural insight into the P1S1 binding mode of diaminoethylphosphonic and phosphinic acids, selective inhibitors of alanine aminopeptidases. Eur J Med Chem117:187-96 (2016) 
 
Aminopeptidase N
Name:Aminopeptidase N
Type:PROTEIN
Mol. Mass.:109522.63
Organism:Homo sapiens (Human)
Description:ChEMBL_1507526
Residue:967
BDBM50170871
NameBDBM50170871
Synonyms:CHEMBL3806230
TypeSmall organic molecule
Emp. Form.C8H21N4O3P
Mol. Mass.252.2511
SMILESNC(CNCCN1CCNCC1)P(O)(O)=O