Reaction Details
TargetIntegrase
LigandBDBM50170911
Substrate/Competitorn/a
Meas. Tech.ChEMBL_1578164 (CHEMBL3807246)
IC50 4000±n/a nM
Citation Billamboz, MSuchaud, VBailly, FLion, CAndréola, MLChrist, FDebyser, ZCotelle, P 2-hydroxyisoquinoline-1,3(2H,4H)-diones (HIDs) as human immunodeficiency virus type 1 integrase inhibitors: Influence of the alkylcarboxamide substitution of position 4. Eur J Med Chem117:256-68 (2016) 
 
Integrase
Name:Integrase
Synonyms:pol
Type:PROTEIN
Mol. Mass.:32203.43
Organism:Human immunodeficiency virus 1
Description:ChEMBL_106649
Residue:288
BDBM50170911
NameBDBM50170911
Synonyms:CHEMBL3805358
TypeSmall organic molecule
Emp. Form.C13H12N2O4
Mol. Mass.260.2454
SMILESON1C(=O)C(C(=O)NC2CC2)c2ccccc2C1=O