Reaction Details
TargetCarbonic anhydrase 2
LigandBDBM50171206
Substrate/Competitorn/a
Meas. Tech.ChEMBL_1576949 (CHEMBL3806792)
Ki 1752±n/a nM
Citation Chandak, NCeruso, MSupuran, CTSharma, PK Novel sulfonamide bearing coumarin scaffolds as selective inhibitors of tumor associated carbonic anhydrase isoforms IX and XII. Bioorg Med Chem24:2882-2886 (2016) 
 
Carbonic anhydrase 2
Name:Carbonic anhydrase 2
Type:Enzyme
Mol. Mass.:29250.71
Organism:Homo sapiens (Human)
Description:P00918
Residue:260
BDBM50171206
NameBDBM50171206
Synonyms:CHEMBL3805919
TypeSmall organic molecule
Emp. Form.C17H14BrN3O4S
Mol. Mass.436.28
SMILESC\C(=N/Nc1ccc(cc1)S(N)(=O)=O)c1cc2cc(Br)ccc2oc1=O