Reaction Details
TargetCarbonic anhydrase 9
LigandBDBM50171193
Substrate/Competitorn/a
Meas. Tech.ChEMBL_1576950 (CHEMBL3806793)
Ki 2.3±n/a nM
Citation Chandak, NCeruso, MSupuran, CTSharma, PK Novel sulfonamide bearing coumarin scaffolds as selective inhibitors of tumor associated carbonic anhydrase isoforms IX and XII. Bioorg Med Chem24:2882-2886 (2016) 
 
Carbonic anhydrase 9
Name:Carbonic anhydrase 9
Type:Enzyme
Mol. Mass.:49669.03
Organism:Homo sapiens (Human)
Description:Catalytic domain of human cloned isozyme was used in the assay
Residue:459
BDBM50171193
NameBDBM50171193
Synonyms:CHEMBL3805892
TypeSmall organic molecule
Emp. Form.C28H19ClN6O4S2
Mol. Mass.603.071
SMILESNS(=O)(=O)c1ccc(cc1)-n1cc(\C=N/Nc2nc(cs2)-c2cc3ccccc3oc2=O)c(n1)-c1ccc(Cl)cc1