Reaction Details
TargetCarbonic anhydrase 9
LigandBDBM50171198
Substrate/Competitorn/a
Meas. Tech.ChEMBL_1576950 (CHEMBL3806793)
Ki 24±n/a nM
Citation Chandak, NCeruso, MSupuran, CTSharma, PK Novel sulfonamide bearing coumarin scaffolds as selective inhibitors of tumor associated carbonic anhydrase isoforms IX and XII. Bioorg Med Chem24:2882-2886 (2016) 
 
Carbonic anhydrase 9
Name:Carbonic anhydrase 9
Type:Enzyme
Mol. Mass.:49669.03
Organism:Homo sapiens (Human)
Description:Catalytic domain of human cloned isozyme was used in the assay
Residue:459
BDBM50171198
NameBDBM50171198
Synonyms:CHEMBL3804869
TypeSmall organic molecule
Emp. Form.C18H12BrN3O4S2
Mol. Mass.478.34
SMILESNS(=O)(=O)c1ccc(Nc2nc(cs2)-c2cc3cc(Br)ccc3oc2=O)cc1