Reaction Details
TargetCarbonic anhydrase 12
LigandBDBM50171188
Substrate/Competitorn/a
Meas. Tech.ChEMBL_1576951 (CHEMBL3806794)
Ki 2.5±n/a nM
Citation Chandak, NCeruso, MSupuran, CTSharma, PK Novel sulfonamide bearing coumarin scaffolds as selective inhibitors of tumor associated carbonic anhydrase isoforms IX and XII. Bioorg Med Chem24:2882-2886 (2016) 
 
Carbonic anhydrase 12
Name:Carbonic anhydrase 12
Type:Enzyme
Mol. Mass.:39456.00
Organism:Homo sapiens (Human)
Description:Catalytic domain of human cloned isozyme was used in the assay
Residue:354
BDBM50171188
NameBDBM50171188
Synonyms:CHEMBL3805601
TypeSmall organic molecule
Emp. Form.C28H19ClN6O4S2
Mol. Mass.603.071
SMILESNS(=O)(=O)c1ccc(cc1)-n1cc(\C=N/Nc2nc(cs2)-c2cc3cc(Cl)ccc3oc2=O)c(n1)-c1ccccc1